Solved : Could not determine java version when running gradle

Error : 21:04:36.791 [INFO] [org.gradle.internal.nativeintegration.services.NativeServices] Initialized native services in: /home/ubuntu/.gradle/native 21:04:36.817 [ERROR] [org.gradle.internal.buildevents.BuildExceptionReporter] 21:04:36.819 [ERROR] [org.gradle.internal.buildevents.BuildExceptionReporter] FAILURE: Build failed with an exception. 21:04:36.819 [ERROR] [org.gradle.internal.buildevents.BuildExceptionReporter] 21:04:36.819 [ERROR] [org.gradle.internal.buildevents.BuildExceptionReporter] * What went wrong: 21:04:36.822 [ERROR] [org.gradle.internal.buildevents.BuildExceptionReporter] Could not determine java version from ‘9.0.4’. 21:04:36.822 [ERROR] [org.gradle.internal.buildevents.BuildExceptionReporter] 21:04:36.822 [ERROR] [org.gradle.internal.buildevents.BuildExceptionReporter] * Exception is: 21:04:36.823 [ERROR] [org.gradle.internal.buildevents.BuildExceptionReporter] java.lang.IllegalArgumentException:…

Install GRADLE in Amazon Linux

  #!/bin/sh gradle_version=”4.4-rc-5″ #Your Custom Installation Path install_target_path=”/opt/gradle” wget -N https://services.gradle.org/distributions/gradle-${gradle_version}-all.zip mkdir -p ${install_target_path} unzip gradle-${gradle_version}-all.zip mv gradle-${gradle_version} ${install_target_path}/ ln -sfn gradle-${gradle_version} ${install_target_path}/latest chown -R ec2-user:ec2-userĀ ${install_target_path} printf “export GRADLE_HOME=${install_target_path}/latest\nexport PATH=\$PATH:\$GRADLE_HOME/bin” > /etc/profile.d/gradle.sh . /etc/profile.d/gradle.sh # check installation gradle -v