Solved : Could not determine java version when running gradle

Error :

21:04:36.791 [INFO] [org.gradle.internal.nativeintegration.services.NativeServices] Initialized native services in: /home/ubuntu/.gradle/native
21:04:36.817 [ERROR] [org.gradle.internal.buildevents.BuildExceptionReporter]
21:04:36.819 [ERROR] [org.gradle.internal.buildevents.BuildExceptionReporter] FAILURE: Build failed with an exception.
21:04:36.819 [ERROR] [org.gradle.internal.buildevents.BuildExceptionReporter]
21:04:36.819 [ERROR] [org.gradle.internal.buildevents.BuildExceptionReporter] * What went wrong:
21:04:36.822 [ERROR] [org.gradle.internal.buildevents.BuildExceptionReporter] Could not determine java version from ‘9.0.4’.
21:04:36.822 [ERROR] [org.gradle.internal.buildevents.BuildExceptionReporter]
21:04:36.822 [ERROR] [org.gradle.internal.buildevents.BuildExceptionReporter] * Exception is:
21:04:36.823 [ERROR] [org.gradle.internal.buildevents.BuildExceptionReporter] java.lang.IllegalArgumentException: Could not determine java version from ‘9.0.4’.
21:04:36.823 [ERROR] [org.gradle.internal.buildevents.BuildExceptionReporter] at org.gradle.api.JavaVersion.toVersion(JavaVersion.java:70)
21:04:36.823 [ERROR] [org.gradle.internal.buildevents.BuildExceptionReporter] at org.gradle.api.JavaVersion.current(JavaVersion.java:80)
21:04:36.823 [ERROR] [org.gradle.internal.buildevents.BuildExceptionReporter] at org.gradle.internal.jvm.UnsupportedJavaRuntimeException.assertUsingVersion(UnsupportedJavaRuntimeException.java:29)
21:04:36.824 [ERROR] [org.gradle.internal.buildevents.BuildExceptionReporter] at org.gradle.launcher.cli.JavaRuntimeValidationAction.execute(JavaRuntimeValidationAction.java:32)
21:04:36.824 [ERROR] [org.gradle.internal.buildevents.BuildExceptionReporter] at org.gradle.launcher.cli.JavaRuntimeValidationAction.execute(JavaRuntimeValidationAction.java:24)
21:04:36.824 [ERROR] [org.gradle.internal.buildevents.BuildExceptionReporter] at org.gradle.launcher.cli.ExceptionReportingAction.execute(ExceptionReportingAction.java:33)
21:04:36.824 [ERROR] [org.gradle.internal.buildevents.BuildExceptionReporter] at org.gradle.launcher.cli.ExceptionReportingAction.execute(ExceptionReportingAction.java:22)
21:04:36.824 [ERROR] [org.gradle.internal.buildevents.BuildExceptionReporter] at org.gradle.launcher.cli.CommandLineActionFactory$WithLogging.execute(CommandLineActionFactory.java:210)
21:04:36.824 [ERROR] [org.gradle.internal.buildevents.BuildExceptionReporter] at org.gradle.launcher.cli.CommandLineActionFactory$WithLogging.execute(CommandLineActionFactory.java:174)
21:04:36.824 [ERROR] [org.gradle.internal.buildevents.BuildExceptionReporter] at org.gradle.launcher.Main.doAction(Main.java:33)
21:04:36.824 [ERROR] [org.gradle.internal.buildevents.BuildExceptionReporter] at org.gradle.launcher.bootstrap.EntryPoint.run(EntryPoint.java:45)
21:04:36.824 [ERROR] [org.gradle.internal.buildevents.BuildExceptionReporter] at java.base/jdk.internal.reflect.NativeMethodAccessorImpl.invoke0(Native Method)
21:04:36.824 [ERROR] [org.gradle.internal.buildevents.BuildExceptionReporter] at java.base/jdk.internal.reflect.NativeMethodAccessorImpl.invoke(NativeMethodAccessorImpl.java:62)
21:04:36.824 [ERROR] [org.gradle.internal.buildevents.BuildExceptionReporter] at java.base/jdk.internal.reflect.DelegatingMethodAccessorImpl.invoke(DelegatingMethodAccessorImpl.java:43)
21:04:36.825 [ERROR] [org.gradle.internal.buildevents.BuildExceptionReporter] at java.base/java.lang.reflect.Method.invoke(Method.java:564)
21:04:36.825 [ERROR] [org.gradle.internal.buildevents.BuildExceptionReporter] at org.gradle.launcher.bootstrap.ProcessBootstrap.runNoExit(ProcessBootstrap.java:60)
21:04:36.825 [ERROR] [org.gradle.internal.buildevents.BuildExceptionReporter] at org.gradle.launcher.bootstrap.ProcessBootstrap.run(ProcessBootstrap.java:37)
21:04:36.825 [ERROR] [org.gradle.internal.buildevents.BuildExceptionReporter] at org.gradle.launcher.GradleMain.main(GradleMain.java:23)

 

Solution :

spradhan $ vi gradle/wrapper/gradle-wrapper.properties

distributionBase=GRADLE_USER_HOME distributionPath=wrapper/dists zipStoreBase=GRADLE_USER_HOME zipStorePath=wrapper/dists distributionUrl=https\://services.gradle.org/distributions/gradle-4.3-src.zip

Update the part marked as RED to -all or -bin

spradhan $ vi gradle/wrapper/gradle-wrapper.properties

distributionBase=GRADLE_USER_HOME distributionPath=wrapper/dists zipStoreBase=GRADLE_USER_HOME zipStorePath=wrapper/dists distributionUrl=https\://services.gradle.org/distributions/gradle-4.3all.zip

Advertisements

Leave a Reply

Please log in using one of these methods to post your comment:

WordPress.com Logo

You are commenting using your WordPress.com account. Log Out /  Change )

Google+ photo

You are commenting using your Google+ account. Log Out /  Change )

Twitter picture

You are commenting using your Twitter account. Log Out /  Change )

Facebook photo

You are commenting using your Facebook account. Log Out /  Change )

w

Connecting to %s